NO,����,����_�J�i,�Z��,����,�ܓx,�o�x,�W��,�d�b�ԍ�,�����ԍ�,�s�撬���R�[�h,�s���{����,�s�撬����,�ЊQ���_�^��,�ЊQ���_�R����A�y�Η��y�ђn����,�ЊQ���_����,�ЊQ���_�n�k,�ЊQ���_�Ôg,�ЊQ���_��K�͂ȉΎ�,�ЊQ���_�����×�,�ЊQ���_�ΎR����,�w����Ƃ̏d��,�z����e�l��,�ΏۂƂȂ钬��E������,URL,���l
1,�k�g�䏬�w�Z�O���E���h,�L�^���V�C�V���E�K�b�R�E�O���E���h,���Q�������s�u�Ð�131,,33.805714 ,132.880490 ,,089-964-2119,,382159,���Q��,�����s,1,1,,1,,,,,1,,,,
2,��g�䏬�w�Z�O���E���h,�~�i�~���V�C�V���E�K�b�R�E�O���E���h,���Q�������s�c�E1100,,33.791569 ,132.853297 ,,089-964-3504,,382159,���Q��,�����s,1,1,,1,,,,,1,,,,
3,�q�u���w�Z�O���E���h,�n�C�V�V���E�K�b�R�E�O���E���h,���Q�������s���эb1585,,33.779198 ,132.870700 ,,089-964-2015,,382159,���Q��,�����s,,,,1,,,,,1,,,,
4,��я��w�Z�O���E���h,�J�~�n���V�V���E�K�b�R�E�O���E���h,���Q�������s��эb2565,,33.755859 ,132.886874 ,,089-964-3574,,382159,���Q��,�����s,1,1,,1,,,,,1,,,,
5,��㏬�w�Z�O���E���h,�J���J�~�V���E�K�b�R�E�O���E���h,���Q�������s�k���b2655,,33.800961 ,132.904266 ,,089-966-2021,,382159,���Q��,�����s,1,1,,1,,,,,1,,,,
6,���J���w�Z�O���E���h,�q�K�V�_�j�V���E�K�b�R�E�O���E���h,���Q�������s���V���b334,,33.792008 ,132.953436 ,,089-960-6711,,382159,���Q��,�����s,1,,,1,,,,,1,,,,
7,���J���w�Z�O���E���h,�j�V�_�j�V���E�K�b�R�E�O���E���h,���Q�������s���V����835,,33.771114 ,132.917373 ,,089-960-6411,,382159,���Q��,�����s,1,,,1,,,,,1,,,,
8,�d�M���w�Z�O���E���h,�V�Q�m�u�`���E�K�b�R�E�O���E���h,���Q�������s�u�Ð�991,,33.795717 ,132.871697 ,,089-964-2007,,382159,���Q��,�����s,1,1,,1,,,,,1,,,,
9,������w�Z�O���E���h,�J���E�`�`���E�K�b�R�E�O���E���h,���Q�������s���467-1,,33.797232 ,132.912541 ,,089-966-2031,,382159,���Q��,�����s,1,1,,1,,,,,1,,,,
10,���������ْ��ԏ�,�`���E�I�E�R�E�~���J���`���E�V���W���E,���Q�������s�c�E2370,,33.793730 ,132.871286 ,,089-964-1500,,382159,���Q��,�����s,1,1,,1,,,,,1,,,,
11,��������ْ��ԏ�,�J���E�`�R�E�~���J���`���E�V���W���E,���Q�������s���264,,33.797773 ,132.914874 ,,089-966-4721,,382159,���Q��,�����s,1,1,,1,,,,,1,,,,
12,�_�ыƎ҃g���[�j���O�Z���^�[�L��,�m�E�����M���E�V���g���[�j���O�Z���^�[�q���o,���Q�������s�c�E235,,33.790494 ,132.868054 ,,089-964-6037,,382159,���Q��,�����s,1,1,,1,,,,,,,,,
13,�_�������P�Z���^�[���ԏ�,�m�E�\���J���L���E�J�C�[���Z���^�[�`���E�V���W���E,���Q�������s�c�E300,,33.791996 ,132.867918 ,,089-964-9400,,382159,���Q��,�����s,1,1,,1,,,,,1,,,,
14,��������,�\�E�S�E�R�E�G��,���Q�������s�����b1284-1,,33.809193 ,132.868076 ,,089-964-4440,,382159,���Q��,�����s,1,1,,1,,,,,,,,,
15,����̈�Z���^�[���ԏ�,�J���E�`�^�C�C�N�Z���^�[�`���E�V���W���E,���Q�������s�k���b2314-2,,33.802845 ,132.907788 ,,089-966-4882,,382159,���Q��,�����s,1,1,,1,,,,,,,,,
16,������N�Z���^�[���ԏ�,�J���E�`�P���R�E�Z���^�[�`���E�V���W���E,���Q�������s���262,,33.796867 ,132.914307 ,,089-966-2191,,382159,���Q��,�����s,1,1,,1,,,,,1,,,,
17,���쐶�����P�Z���^�[�L��,�i���J���Z�C�J�c�J�C�[���Z���^�[�q���o,���Q�������s����b1422,,33.801259 ,132.993715 ,,,,382159,���Q��,�����s,1,1,,1,,,,,1,,,,
18,��邬����,�����M�R�E�G��,���Q�������s��c1����19,,33.793837 ,132.840472 ,,,,382159,���Q��,�����s,1,1,,1,,,,,,,,,
19,�Ă񂶂����,�e���W���R�E�G��,���Q�������s��c3����3,,33.794951 ,132.834490 ,,,,382159,���Q��,�����s,1,1,,1,,,,,,,,,
20,���킪�炱�ǂ��ٍL��,�C���K���R�h���J���q���o,���Q�������s���͌�1368-1,,33.805057 ,132.882836 ,,,,382159,���Q��,�����s,1,1,,1,,,,,1,,,,
21,�������_������,�E�V�u�`�E�G�m�m�E�\���R�E�G��,���Q�������s����1625,,33.796904 ,132.857024 ,,,,382159,���Q��,�����s,1,1,,1,,,,,,,,,
22,���є����_������,�V���n���V�n�`�}���m�E�\���R�E�G��,���Q�������s���эb297-1,,33.774411 ,132.884296 ,,,,382159,���Q��,�����s,1,1,,1,,,,,,,,,
23,�c�E���،���,�^�m�N�{�~�Y�L�R�E�G��,���Q�������s�c�E3007-1,,33.794141 ,132.864255 ,,,,382159,���Q��,�����s,1,1,,1,,,,,,,,,
24,������������,�E�V�u�`���R�n�^�R�E�G��,���Q�������s����1093,,33.795326 ,132.847984 ,,,,382159,���Q��,�����s,1,1,,1,,,,,,,,,
25,�����n�ӂꂠ���L��,�n�b�^���W�t���A�C�q���o,���Q�������s�u�Ð�b1327-1,,33.797642 ,132.869004 ,,,,382159,���Q��,�����s,1,1,,1,,,,,,,,,
26,���d�M�����ɐ�,�L���E�V�Q�m�u�`���E�`���E�V���A�g,���Q�������s�u�Ð�972,,33.796165 ,132.874359 ,,,,382159,���Q��,�����s,1,1,,1,,,,,,,,,
27,������������ٍL��,�I�N�}�Z�J���R�E�~���J���q���o,���Q�������s�����쉳80-1,,33.810308 ,132.946784 ,,,,382159,���Q��,�����s,1,1,,1,,,,,1,,,,
28,�y�J�W��L��,�c�`���V���E�J�C�V���q���o,���Q�������s�͔V���b1211-1,,33.809975 ,132.975114 ,,,,382159,���Q��,�����s,1,,,1,,,,,1,,,,
29,���������,�~�i�~�K�^�q�K�V�R�E�G��,���Q�������s���504-8,,33.796455 ,132.911494 ,,,,382159,���Q��,�����s,1,1,,1,,,,,,,,,
30,�k��������,�L�^�K�^�j�V�R�E�G��,���Q�������s�k���b3164-1,,33.802783 ,132.895160 ,,,,382159,���Q��,�����s,1,1,,1,,,,,,,,,
31,����x�����ԏ�,�J���E�`�V�V���`���E�V���W���E,���Q�������s���286,,33.797748 ,132.914907 ,,089-966-2222,,382159,���Q��,�����s,1,1,,1,,,,,,,,,
32,�ӂ邳�ƌ𗬊ق�����̓��L��,�t���T�g�R�E�����E�J���T�N���m���q���o,���Q�������s�k���b2081-1,,33.803048 ,132.914502 ,,089-960-6511,,382159,���Q��,�����s,1,1,,1,,,,,,,,,
33,���ڂ̐����,�N�{�m�C�Y�~�R�E�G��,���Q�������s���1166-1,,33.793300 ,132.894800 ,,,,382159,���Q��,�����s,1,1,,1,,,,,,,,,
34,�x�c����,�I�h���_�R�E�G��,���Q�������s�u�Ð��4����301,,33.800600 ,132.874900 ,,,,382159,���Q��,�����s,1,1,,1,,,,,,,,,
35,���яW�,�V���n���V�V���E�J�C�V��,���Q�������s����1571,,33.780100 ,132.871600 ,,,,382159,���Q��,�����s,,1,,1,,,,,1,,,,
36,���R�Y�������ԏ�,�}�c���}�P�C���V���`���E�V���W���E,���Q�������s���ޗ�1243-2,,33.794664,132.878829,,089-964-3355,,382159,���Q��,�����s,1,1,,1,,,,,1,,,,
